compare-v
type: LexicalEntry
canonical form: compare
sense: 00654571-v
part of speech: verb

00654571-v
type: LexicalConcept
in scheme: en-word.net
definition: examine and note the similarities or differences of
example: John compared his haircut to his friend's
example: We compared notes after we had both seen the movie
ili: i24995
lexfile: verb.cognition
part of speech: verb
hypernym: 00646245-v
similar: 02735507-v