critical-a
type: LexicalEntry
canonical form: critical
sense: https://en-word.net/lemma/critical-a#00653599-a
part of speech: adjective

https://en-word.net/synset/00653599-a
type: LexicalConcept
in scheme: en-word.net
definition: being in or verging on a state of crisis or emergency
example: a critical shortage of food
example: a critical illness
example: an illness at the critical stage
ili: i3614
lexfile: adj.all
part of speech: adjective
also: https://en-word.net/synset/00658802-a
attribute: 13956593-n
similar: 00653922-s
similar: 00654061-s
similar: 00654473-s