survey-v
type: LexicalEntry
canonical form: survey
sense: 00649582-v
part of speech: verb

00649582-v
type: LexicalConcept
in scheme: en-word.net
definition: make a survey of; for statistical purposes
ili: i24973
lexfile: verb.cognition
part of speech: verb
hypernym: 00646245-v