read-v
type: LexicalEntry
canonical form: read
sense: 00628065-v
part of speech: verb

00628065-v
type: LexicalConcept
in scheme: en-word.net
definition: look at, interpret, and say out loud something that is written or printed
example: The King will read the proclamation at noon
ili: i24882
lexfile: verb.cognition
part of speech: verb
hypernym: 00944022-v
similar: 00626756-v