spiritualize-v
type: LexicalEntry
canonical form: spiritualize
sense: 00625619-v
part of speech: verb

spiritualise-v
type: LexicalEntry
canonical form: spiritualise
sense: 00625619-v
part of speech: verb

00625619-v
type: LexicalConcept
in scheme: en-word.net
definition: give a spiritual meaning to; read in a spiritual sense
ili: i24869
lexfile: verb.cognition
part of speech: verb
hypernym: 00624823-v