abandon-v
type: LexicalEntry
canonical form: abandon
sense: 00614907-v
part of speech: verb

give up-v
type: LexicalEntry
canonical form: give up
sense: 00614907-v
part of speech: verb

00614907-v
type: LexicalConcept
in scheme: en-word.net
definition: stop maintaining or insisting on; of ideas or claims
example: He abandoned the thought of asking for her hand in marriage
example: Both sides have to give up some claims in these negotiations
ili: i24825
lexfile: verb.cognition
part of speech: verb
hypernym: 02372362-v
similar: 01993067-v
similar: 01852407-v