train-v
type: LexicalEntry
canonical form: train
sense: 00604200-v
part of speech: verb

prepare-v
type: LexicalEntry
canonical form: prepare
sense: 00604200-v
part of speech: verb

00604200-v
type: LexicalConcept
in scheme: en-word.net
definition: undergo training or instruction in preparation for a particular role, function, or profession
example: She is training to be a teacher
example: He trained as a legal aid
ili: i24774
lexfile: verb.cognition
part of speech: verb
hypernym: 00601387-v
similar: 00604693-v
similar: 02392176-v