obsessed-a
type: LexicalEntry
canonical form: obsessed
sense: 00602112-s
part of speech: adjective

possessed-a
type: LexicalEntry
canonical form: possessed
sense: 00602112-s
part of speech: adjective

00602112-s
type: LexicalConcept
in scheme: en-word.net
definition: influenced or controlled by a powerful force such as a strong emotion
example: by love possessed
ili: i3327
lexfile: adj.all
part of speech: adjective satellite
similar: https://en-word.net/synset/00601323-a