master-v
type: LexicalEntry
canonical form: master
sense: 00598780-v
part of speech: verb

control-v
type: LexicalEntry
canonical form: control
sense: 00598780-v
part of speech: verb

00598780-v
type: LexicalConcept
in scheme: en-word.net
definition: have a firm understanding or knowledge of; be on top of
example: Do you control these data?
ili: i24748
lexfile: verb.cognition
part of speech: verb
entails: 00590283-v
hypernym: 00597330-v
similar: 01227308-v