know-v
type: LexicalEntry
canonical form: know
sense: 00595732-v
part of speech: verb

00595732-v
type: LexicalConcept
in scheme: en-word.net
definition: be familiar or acquainted with a person or an object
example: She doesn't know this composer
example: Do you know my sister?
example: We know this movie
example: I know him under a different name
example: This flower is known as a Peruvian Lily
ili: i24735
lexfile: verb.cognition
part of speech: verb
hypernym: 00596016-v
similar: 00609926-v