extrapolate-v
type: LexicalEntry
canonical form: extrapolate
sense: 00595064-v
part of speech: verb

00595064-v
type: LexicalConcept
in scheme: en-word.net
definition: gain knowledge of (an area not known or experienced) by extrapolating
ili: i24732
lexfile: verb.cognition
part of speech: verb
domain topic: 05671913-n
hypernym: 00638236-v