shear-v
type: LexicalEntry
canonical form: shear
sense: 00588295-v
part of speech: verb

00588295-v
type: LexicalConcept
in scheme: en-word.net
definition: become deformed by forces tending to produce a shearing strain
ili: i24700
lexfile: verb.change
part of speech: verb
domain topic: 06100457-n
hypernym: 00109468-v