facility-n
type: LexicalEntry
canonical form: facility
sense: 00586443-n
part of speech: noun

00586443-n
type: LexicalConcept
in scheme: en-word.net
definition: something designed and created to serve a particular function and to afford a particular convenience or service
example: catering facilities
example: toilet facilities
example: educational facilities
ili: i38472
lexfile: noun.act
part of speech: noun
hypernym: 00022119-n