specialization-n
type: LexicalEntry
canonical form: specialization
sense: 00584784-n
part of speech: noun

specialisation-n
type: LexicalEntry
canonical form: specialisation
sense: 00584784-n
part of speech: noun

00584784-n
type: LexicalConcept
in scheme: en-word.net
definition: the act of specializing; making something suitable for a special purpose
ili: i38463
lexfile: noun.act
part of speech: noun
hypernym: 00199979-n