variegate-v
type: LexicalEntry
canonical form: variegate
sense: 00582586-v
part of speech: verb

00582586-v
type: LexicalConcept
in scheme: en-word.net
definition: change the appearance of, especially by marking with different colors
ili: i24663
lexfile: verb.change
part of speech: verb
hypernym: 00126072-v