popularize-v
type: LexicalEntry
canonical form: popularize
sense: 00579585-v
part of speech: verb

popularise-v
type: LexicalEntry
canonical form: popularise
sense: 00579585-v
part of speech: verb

00579585-v
type: LexicalConcept
in scheme: en-word.net
definition: make understandable to the general public
example: Carl Sagan popularized cosmology in his books
ili: i24646
lexfile: verb.change
part of speech: verb
hypernym: 00299025-v
similar: 00972247-v