intensify-v
type: LexicalEntry
canonical form: intensify
sense: 00575812-v
part of speech: verb

00575812-v
type: LexicalConcept
in scheme: en-word.net
definition: make the chemically affected part of (a negative) denser or more opaque in order produce a stronger contrast between light and dark
ili: i24625
lexfile: verb.change
part of speech: verb
domain topic: 00621794-n
hypernym: 00126072-v