overhead-n
type: LexicalEntry
canonical form: overhead
sense: 00570511-n
part of speech: noun

smash-n
type: LexicalEntry
canonical form: smash
sense: 00570511-n
part of speech: noun

00570511-n
type: LexicalConcept
in scheme: en-word.net
definition: a hard return hitting the tennis ball above your head
ili: i38387
lexfile: noun.act
part of speech: noun
hypernym: 00567335-n