fault-n
type: LexicalEntry
canonical form: fault
sense: 00569850-n
part of speech: noun

00569850-n
type: LexicalConcept
in scheme: en-word.net
definition: (sports) a serve that is illegal (e.g., that lands outside the prescribed area)
example: he served too many double faults
ili: i38383
lexfile: noun.act
part of speech: noun
domain topic: 00483309-n
domain topic: 00481519-n
domain topic: 00480898-n
hypernym: 00569467-n