gelatinize-v
type: LexicalEntry
canonical form: gelatinize
sense: 00566356-v
part of speech: verb

gelatinise-v
type: LexicalEntry
canonical form: gelatinise
sense: 00566356-v
part of speech: verb

00566356-v
type: LexicalConcept
in scheme: en-word.net
definition: become gelatinous or change into a jelly
example: the starch gelatinized when it was heated
ili: i24573
lexfile: verb.change
part of speech: verb
hypernym: 00109468-v
similar: 00566158-v