leap-v
type: LexicalEntry
canonical form: leap
sense: 00561468-v
part of speech: verb

jump-v
type: LexicalEntry
canonical form: jump
sense: 00561468-v
part of speech: verb

00561468-v
type: LexicalConcept
in scheme: en-word.net
definition: pass abruptly from one state or topic to another
example: leap into fame
example: jump to a conclusion
example: jump from one thing to another
ili: i24547
lexfile: verb.change
part of speech: verb
hypernym: 00551194-v