program-n
type: LexicalEntry
canonical form: program
sense: 00552252-n
part of speech: noun

programme-n
type: LexicalEntry
canonical form: programme
sense: 00552252-n
part of speech: noun

00552252-n
type: LexicalConcept
in scheme: en-word.net
definition: a performance (or series of performances) at a public presentation
example: the program lasted more than two hours
ili: i38286
lexfile: noun.act
part of speech: noun
hypernym: 00551808-n