impersonation-n
type: LexicalEntry
canonical form: impersonation
sense: 00550321-n
part of speech: noun

personation-n
type: LexicalEntry
canonical form: personation
sense: 00550321-n
part of speech: noun

00550321-n
type: LexicalConcept
in scheme: en-word.net
definition: imitating the mannerisms of another person
ili: i38277
lexfile: noun.act
part of speech: noun
hypernym: 00549363-n