bow-n-1
type: LexicalEntry
canonical form: bow
sense: 00548802-n
part of speech: noun

00548802-n
type: LexicalConcept
in scheme: en-word.net
definition: a stroke with a curved piece of wood with taut horsehair strands that is used in playing stringed instruments
ili: i38270
lexfile: noun.act
part of speech: noun
hypernym: 00350195-n