straggly-a
type: LexicalEntry
canonical form: straggly
sense: 00544880-s
part of speech: adjective

00544880-s
type: LexicalConcept
in scheme: en-word.net
definition: growing or spreading sparsely or irregularly
example: straggly ivy
ili: i3040
lexfile: adj.all
part of speech: adjective satellite
similar: https://en-word.net/synset/00542013-a