music-n
type: LexicalEntry
canonical form: music
sense: 00544270-n
part of speech: noun

00544270-n
type: LexicalConcept
in scheme: en-word.net
definition: musical activity (singing or whistling etc.)
example: his music was his central interest
ili: i38249
lexfile: noun.act
part of speech: noun
domain topic: 07034009-n
domain topic: 00546538-n
hypernym: 00408356-n
mero part: 15311260-n