cure-v
type: LexicalEntry
canonical form: cure
sense: 00529015-v
part of speech: verb

00529015-v
type: LexicalConcept
in scheme: en-word.net
definition: make (substances) hard and improve their usability
example: cure resin
example: cure cement
example: cure soap
ili: i24362
lexfile: verb.change
part of speech: verb
hypernym: 00444071-v