full-a
type: LexicalEntry
canonical form: full
sense: 00524974-s
part of speech: adjective

total-a
type: LexicalEntry
canonical form: total
sense: 00524974-s
part of speech: adjective

00524974-s
type: LexicalConcept
in scheme: en-word.net
definition: complete in extent or degree and in every particular
example: a full game
example: a total eclipse
example: a total disaster
ili: i2933
lexfile: adj.all
part of speech: adjective satellite
similar: https://en-word.net/synset/00522139-a