crib-n
type: LexicalEntry
canonical form: crib
sense: 00493094-n
part of speech: noun

00493094-n
type: LexicalConcept
in scheme: en-word.net
definition: the cards discarded by players at cribbage
ili: i37966
lexfile: noun.act
part of speech: noun
hypernym: 03970276-n