quantify-v
type: LexicalEntry
canonical form: quantify
sense: 00490773-v
part of speech: verb

measure-v
type: LexicalEntry
canonical form: measure
sense: 00490773-v
part of speech: verb

00490773-v
type: LexicalConcept
in scheme: en-word.net
definition: express as a number or measure or quantity
example: Can you quantify your results?
ili: i24158
lexfile: verb.change
part of speech: verb
hypernym: 01062889-v