leach-v
type: LexicalEntry
canonical form: leach
sense: 00489553-v
part of speech: verb

strip-v
type: LexicalEntry
canonical form: strip
sense: 00489553-v
part of speech: verb

00489553-v
type: LexicalConcept
in scheme: en-word.net
definition: remove substances from by a percolating liquid
example: leach the soil
ili: i24151
lexfile: verb.change
part of speech: verb
hypernym: 00173351-v