badminton-n
type: LexicalEntry
canonical form: badminton
sense: 00481519-n
part of speech: noun

00481519-n
type: LexicalConcept
in scheme: en-word.net
definition: a game played on a court with light long-handled rackets used to volley a shuttlecock over a net
ili: i37914
lexfile: noun.act
part of speech: noun
hypernym: 00480087-n