refine-v
type: LexicalEntry
canonical form: refine
sense: 00475693-v
part of speech: verb

00475693-v
type: LexicalConcept
in scheme: en-word.net
definition: treat or prepare so as to put in a usable condition
example: refine paper stock
example: refine pig iron
example: refine oil
ili: i24087
lexfile: verb.change
part of speech: verb
hypernym: 00516235-v