refine-v
type: LexicalEntry
canonical form: refine
sense: 00475423-v
part of speech: verb

rectify-v
type: LexicalEntry
canonical form: rectify
sense: 00475423-v
part of speech: verb

00475423-v
type: LexicalConcept
in scheme: en-word.net
definition: reduce to a fine, unmixed, or pure state; separate from extraneous matter or cleanse from impurities
example: refine sugar
ili: i24086
lexfile: verb.change
part of speech: verb
hypernym: 00476114-v