morph-v
type: LexicalEntry
canonical form: morph
sense: 00470100-v
part of speech: verb

00470100-v
type: LexicalConcept
in scheme: en-word.net
definition: cause to change shape in a computer animation
example: The computer programmer morphed the image
ili: i24062
lexfile: verb.change
part of speech: verb
causes: 00469943-v
hypernym: 00126072-v