suffuse-v
type: LexicalEntry
canonical form: suffuse
sense: 00455206-v
part of speech: verb

perfuse-v
type: LexicalEntry
canonical form: perfuse
sense: 00455206-v
part of speech: verb

00455206-v
type: LexicalConcept
in scheme: en-word.net
definition: cause to spread or flush or flood through, over, or across
example: The sky was suffused with a warm pink color
ili: i23992
lexfile: verb.change
part of speech: verb
hypernym: 00455823-v