familiar-a
type: LexicalEntry
canonical form: familiar
sense: 00455086-s
part of speech: adjective

intimate-a
type: LexicalEntry
canonical form: intimate
sense: 00455086-s
part of speech: adjective

00455086-s
type: LexicalConcept
in scheme: en-word.net
definition: having mutual interests or affections; of established friendship
example: on familiar terms
example: pretending she is on an intimate footing with those she slanders
ili: i2546
lexfile: adj.all
part of speech: adjective satellite
similar: https://en-word.net/synset/00453543-a