farming-n
type: LexicalEntry
canonical form: farming
sense: 00454755-n
part of speech: noun

land-n
type: LexicalEntry
canonical form: land
sense: 00454755-n
part of speech: noun

00454755-n
type: LexicalConcept
in scheme: en-word.net
definition: agriculture considered as an occupation or way of life
example: farming is a strenuous life
example: there's no work on the land any more
ili: i37798
lexfile: noun.act
part of speech: noun
hypernym: 00583425-n