pigsticking-n
type: LexicalEntry
canonical form: pigsticking
sense: 00454655-n
part of speech: noun

00454655-n
type: LexicalConcept
in scheme: en-word.net
definition: the sport of hunting wild boar with spears
ili: i37797
lexfile: noun.act
part of speech: noun
hypernym: 00453279-n