hang-n
type: LexicalEntry
canonical form: hang
sense: 00437279-n
part of speech: noun

00437279-n
type: LexicalConcept
in scheme: en-word.net
definition: a gymnastic exercise performed on the rings or horizontal bar or parallel bars when the gymnast's weight is supported by the arms
ili: i37688
lexfile: noun.act
part of speech: noun
hypernym: 00436718-n