quench-v
type: LexicalEntry
canonical form: quench
sense: 00430716-v
part of speech: verb

00430716-v
type: LexicalConcept
in scheme: en-word.net
definition: reduce the degree of (luminescence or phosphorescence) in (excited molecules or a material) by adding a suitable substance
ili: i23872
lexfile: verb.change
part of speech: verb
domain topic: 06100457-n
hypernym: 00430013-v