cruelty-n
type: LexicalEntry
canonical form: cruelty
sense: 00425602-n
part of speech: noun

inhuman treatment-n
type: LexicalEntry
canonical form: inhuman treatment
sense: 00425602-n
part of speech: noun

00425602-n
type: LexicalConcept
in scheme: en-word.net
definition: a cruel act; a deliberate infliction of pain and suffering
ili: i37636
lexfile: noun.act
part of speech: noun
hypernym: 00420921-n