slacken-v
type: LexicalEntry
canonical form: slacken
sense: 00422078-v
part of speech: verb

remit-v
type: LexicalEntry
canonical form: remit
sense: 00422078-v
part of speech: verb

00422078-v
type: LexicalConcept
in scheme: en-word.net
definition: make slack as by lessening tension or firmness
ili: i23830
lexfile: verb.change
part of speech: verb
causes: 00422361-v
hypernym: 00420328-v