cram-v
type: LexicalEntry
canonical form: cram
sense: 00408071-v
part of speech: verb

00408071-v
type: LexicalConcept
in scheme: en-word.net
definition: prepare (students) hastily for an impending exam
ili: i23760
lexfile: verb.change
part of speech: verb
hypernym: 00407168-v
similar: 00607178-v