flexion-n
type: LexicalEntry
canonical form: flexion
sense: 00406181-n
part of speech: noun

flexure-n
type: LexicalEntry
canonical form: flexure
sense: 00406181-n
part of speech: noun

00406181-n
type: LexicalConcept
in scheme: en-word.net
definition: act of bending a joint; especially a joint between the bones of a limb so that the angle between them is decreased
ili: i37535
lexfile: noun.act
part of speech: noun
hypernym: 00406027-n