impairment-n
type: LexicalEntry
canonical form: impairment
sense: 00404142-n
part of speech: noun

00404142-n
type: LexicalConcept
in scheme: en-word.net
definition: damage that results in a reduction of strength or quality
ili: i37524
lexfile: noun.act
part of speech: noun
hypernym: 00403900-n