hardening-n
type: LexicalEntry
canonical form: hardening
sense: 00403597-n
part of speech: noun

00403597-n
type: LexicalConcept
in scheme: en-word.net
definition: the act of making something harder (firmer or tighter or more compact)
ili: i37521
lexfile: noun.act
part of speech: noun
hypernym: 00376871-n