refine-v
type: LexicalEntry
canonical form: refine
sense: 00402594-v
part of speech: verb

00402594-v
type: LexicalConcept
in scheme: en-word.net
definition: make more precise or increase the discriminatory powers of
example: refine a method of analysis
example: refine the constant in the equation
ili: i23738
lexfile: verb.change
part of speech: verb
hypernym: 00126072-v