involve-v
type: LexicalEntry
canonical form: involve
sense: 00402444-v
part of speech: verb

00402444-v
type: LexicalConcept
in scheme: en-word.net
definition: make complex or intricate or complicated
example: The situation was rather involved
ili: i23737
lexfile: verb.change
part of speech: verb
hypernym: 00401789-v