revision-n
type: LexicalEntry
canonical form: revision
sense: 00400201-n
part of speech: noun

alteration-n
type: LexicalEntry
canonical form: alteration
sense: 00400201-n
part of speech: noun

00400201-n
type: LexicalConcept
in scheme: en-word.net
definition: the act of revising or altering (involving reconsideration and modification)
example: it would require a drastic revision of his opinion
ili: i37503
lexfile: noun.act
part of speech: noun
hypernym: 00399512-n